[aspectc-user] First test of AspectC++ and error

Guillaume Tisserant tisserant at gmail.com
Tue Mar 1 14:02:45 CET 2016

Hello everybody.
I'm new to this list, my name is Guillaume Tisserant, I'm french computer
scientist, and I'm very interested by AspectC++.
I tried to test AspectC++ by downloading the x86_64 package at
http://www.aspectc.org/Download.php, and do a "make", but I have this error

make -C examples/profiling
make[1]: Entering directory
Compiling main.cc
@/home/dworkin/Téléchargements/aspectc++/ag++ -x c++ -c main.cc -o
In file included from <built-in>:6:
In file included from <command line>:255:
./genericprofiler.ah:4:10: fatal error: 'iostream' file not found
#include <iostream>
error: ./genericprofiler.ah:6:17: 'std' is not a known namespace.
error: ./profiler.ah:6:17: 'std' is not a known namespace.
error: Execution failed: "/home/dworkin/Téléchargements/aspectc++/ac++"
--system-config "/tmp/agxx_pcfgpXyN6D"  -p. -c "main.cc" -o
../Makefile.generic:28: recipe for target 'Junk/main.o' failed
make[1]: *** [Junk/main.o] Error 1
make[1]: Leaving directory
Makefile:18: recipe for target 'profiling.make' failed
make: *** [profiling.make] Error 2

I use a Fedora 23 x86_64.
Does I forget to do someting?
Can someone help me?
Thanks a lot
Guillaume Tisserant
-------------- next part --------------
An HTML attachment was scrubbed...
URL: <http://www.aspectc.org/pipermail/aspectc-user/attachments/20160301/436a3607/attachment.html>

More information about the aspectc-user mailing list